{"text_format":"1","workbook":"xlsx","n_sheets":5,"sheets":["ENTRATE","Zona di Carico","STATS S.","TARE","MERCI"],"not_rendered":{"charts":0,"images":14,"macros":1,"external_links":0,"defined_names":2,"comments":1,"pivot_tables":0},"unopened":[],"bounds":{"document_bytes":16777216,"sheet_cells":100000,"rows_first":2000,"rows_last":500,"rows_between":2000,"halvings":0,"cell_chars":16384,"cell_head_chars":4096},"cells_cut":0,"cells_raw":0,"read":"whole","date_system":"1900"}

{"sheet":"ENTRATE","index":0,"n_rows":201,"n_cols":38,"rows_kept":201,"cut":false,"hidden":false,"merged":[[16,34,16,37],[18,34,18,37],[20,34,20,37],[8,33,8,39],[10,34,10,37],[12,34,12,37],[14,34,14,37],[18,19,18,20],[20,19,20,20],[0,8,0,10],[0,18,0,19],[5,19,5,20],[16,19,16,20],[12,26,12,28],[10,26,10,28],[16,26,16,28],[8,25,8,31],[7,19,7,21],[1,18,1,23],[3,19,3,20],[14,26,14,28],[14,19,14,20],[12,19,12,21],[10,19,10,20],[9,19,9,20],[11,19,11,20],[53,18,53,20],[54,19,54,20],[55,18,55,20],[56,19,56,20],[57,18,57,20],[22,26,22,28],[20,26,20,28],[18,26,18,28],[26,26,26,28],[28,26,28,28],[30,26,30,28],[32,26,32,28],[37,18,37,22],[24,26,24,28],[34,19,34,20],[36,18,36,20],[34,26,34,28],[36,26,36,37],[28,19,28,20],[30,19,30,20],[32,19,32,20],[22,19,22,20],[24,19,24,20],[26,19,26,20],[39,18,39,20],[40,19,40,20],[41,18,41,20],[42,19,42,20],[48,19,48,20],[49,18,49,20],[50,19,50,20],[51,18,51,20],[52,19,52,20],[58,19,58,20],[59,18,59,20],[60,19,60,20],[61,18,61,20],[62,19,62,20],[46,26,46,27],[44,26,44,37],[48,26,48,27],[38,26,38,27],[40,26,40,27],[42,26,42,27],[46,28,46,32],[48,28,48,32],[38,28,38,32],[38,33,38,35],[42,28,42,32],[40,28,40,32],[46,33,46,35],[38,19,38,20],[44,19,44,20],[45,18,45,20],[46,19,46,20],[47,18,47,20],[43,18,43,20],[78,19,78,20],[79,18,79,20],[80,19,80,20],[81,18,81,20],[73,18,73,20],[74,19,74,20],[75,18,75,20],[76,19,76,20],[77,18,77,20],[68,19,68,20],[69,18,69,20],[70,19,70,20],[71,18,71,20],[72,19,72,20],[63,18,63,20],[64,19,64,20],[65,18,65,20],[66,19,66,20],[67,18,67,20]]}
["N","TARGA","VETTORE","E","TARA ","CLIENTE","N","MERCE",null,null,null,"S1","S2","NOTE/SEGNALAZIONI","ORDINE","ZONA","N"]
[1,null,null,null,null,null,null,null,{"$f":"IF(H2<>\"\", IF(I2=\"\", NOW(), I2), \"\")","v":""},null,{"$f":"IF(L2<>\"\", IF(K2=\"\", NOW(), K2), \"\")","v":""},null,null,{"$f":"IF(OR(AND(B2=$T$39,F2=$S$40,B2<>\"\",F2<>\"\"),AND(B2=$T$41,F2=$S$42,B2<>\"\",F2<>\"\"),AND(B2=$T$43,F2=$S$44,B2<>\"\",F2<>\"\"),AND(B2=$T$45,F2=$S$46,B2<>\"\",F2<>\"\"),AND(B2=$T$47,F2=$S$48,B2<>\"\",F2<>\"\"),AND(B2=$T$49,F2=$S$50,B2<>\"\",F2<>\"\"),AND(B2=$T$51,F2=$S$52,B2<>\"\",F2<>\"\"),AND(B2=$T$53,F2=$S$54,B2<>\"\",F2<>\"\"),AND(B2=$T$55,F2=$S$56,B2<>\"\",F2<>\"\"),AND(B2=$T$57,F2=$S$58,B2<>\"\",F2<>\"\"),AND(B2=$T$59,F2=$S$60,B2<>\"\",F2<>\"\"),AND(B2=$T$61,F2=$S$62,B2<>\"\",F2<>\"\"),AND(B2=$T$63,F2=$S$64,B2<>\"\",F2<>\"\"),AND(B2=$T$65,F2=$S$66,B2<>\"\",F2<>\"\"),AND(B2=$T$67,F2=$S$68,B2<>\"\",F2<>\"\"),AND(B2=$T$69,F2=$S$70,B2<>\"\",F2<>\"\"),AND(B2=$T$71,F2=$S$72,B2<>\"\",F2<>\"\"),AND(B2=$T$73,F2=$S$74,B2<>\"\",F2<>\"\"),AND(B2=$T$75,F2=$S$76,B2<>\"\",F2<>\"\"),AND(B2=$T$77,F2=$S$78,B2<>\"\",F2<>\"\"),AND(B2=$T$79,F2=$S$80,B2<>\"\",F2<>\"\"),AND(B2=$T$81,F2=$S$82,B2<>\"\",F2<>\"\")),\"TRASFERIMENTO\",\"\")","v":""},null,null,null,null,"STATISTICHE GIORNALIERE"]
[2,null,null,null,null,null,null,null,{"$f":"IF(H3<>\"\", IF(I3=\"\", NOW(), I3), \"\")","v":""},null,{"$f":"IF(L3<>\"\", IF(K3=\"\", NOW(), K3), \"\")","v":""},null,null,""]
[3,null,null,null,null,null,null,null,"",null,{"$f":"IF(L4<>\"\", IF(K4=\"\", NOW(), K4), \"\")","v":""},null,null,"",null,null,null,null,null,"Totale camion entrati",null,null,{"$f":"COUNT(I2:I201)","v":0}]
[4,null,null,null,null,null,null,null,"",null,"",null,null,""]
[5,null,null,null,null,null,null,null,"",null,"",null,null,"",null,null,null,null,null,"Totale Camion usciti",null,null,{"$f":"COUNT(K2:K201)","v":0}]
[6,null,null,null,null,null,null,null,"",null,"",null,null,""]
[7,null,null,null,null,null,null,null,"",null,"",null,null,"",null,null,null,null,null,"Totale camion dentro: ",null,null,{"$f":"W4-W6","v":0}]
[8,null,null,null,null,null,null,null,"",null,"",null,null,"",null,null,null,null,null,null,null,null,null,"IN","DIF","LEGENDA PER NOTE E SEGNALAZIONI",null,null,null,null,null,null,null,"LEGENDA PER NOTE AGGIUNTIVE"]
[9,null,null,null,null,null,null,null,"",null,"",null,null,"",null,null,null,null,null,"BANDA STA",null,null,{"$f":"COUNTIF(H2:H201,\"BANDA STA\")","v":0},{"$f":"COUNTIFS(H2:H201,\"=BANDA STA\", K2:K201,\">0\")","v":0},{"$f":"W10-X10","v":0}]
[10,null,null,null,null,null,null,null,"",null,"",null,null,"",null,null,null,null,null,"PROFILI ACC",null,null,{"$f":"COUNTIF(H2:H201,\"PROFILI ACC\")","v":0},{"$f":"COUNTIFS(H2:H201,\"=PROFILI ACC\", K2:K201,\">0\")","v":0},{"$f":"W11-X11","v":0},null,"PRENOTAZIONE FASULLA ",null,null,null,{"$f":"COUNTIF(N2:N201,\"PRENOTAZIONE FASULLA\")","v":0},null,null,null,"SCARICO SETRAMAR"]
[11,null,null,null,null,null,null,null,"",null,"",null,null,"",null,null,null,null,null,"PARTI PRESSE",null,null,{"$f":"COUNTIF(H2:H201,\"PARTI PRESSE\")","v":0},{"$f":"COUNTIFS(H2:H201,\"=PARTI PRESSE\", K2:K201,\">0\")","v":0},{"$f":"W12-X12","v":0}]
[12,null,null,null,null,null,null,null,"",null,"",null,null,"",null,null,null,null,null,null,null,null,null,null,null,null,"ASSENTE ",null,null,null,{"$f":"COUNTIF(N2:N201,\"ASSENTE\")","v":0},null,null,null,"BUONO ANTICIPATO"]
[13,null,null,null,null,null,null,null,"",null,"",null,null,""]
[14,null,null,null,null,null,null,null,"",null,"",null,null,"",null,null,null,null,null,"GHISA",null,null,{"$f":"COUNTIF(H2:H201,\"GHISA\")","v":0},{"$f":"COUNTIFS(H2:H201,\"=GHISA\", K2:K201,\">0\")","v":0},{"$f":"W15-X15","v":0},null,"T1",null,null,null,{"$f":"COUNTIF(N2:N201,\"T1\")","v":0},null,null,null,"TUTTO IL GIORNO"]
[15,null,null,null,null,null,null,null,"",null,"",null,null,""]
[16,null,null,null,null,null,null,null,"",null,"",null,null,"",null,null,null,null,null,"Totale Camion Coils",null,null,{"$f":"COUNTIF(H2:H201,\"COILS\")","v":0},{"$f":"COUNTIFS(H2:H201,\"=COILS\", K2:K201,\">0\")","v":0},{"$f":"W17-X17","v":0},null,"INOX",null,null,null,{"$f":"COUNTIF(N2:N201,\"INOX\")","v":0},null,null,null,"MANCA PRATICA"]
[17,null,null,null,null,null,null,null,"",null,"",null,null,""]
[18,null,null,null,null,null,null,null,"",null,"",null,null,"",null,null,null,null,null,"Totale Camion Lamiere",null,null,{"$f":"COUNTIF(H2:H201,\"LAMIERE\")","v":0},{"$f":"COUNTIFS(H2:H201,\"=LAMIERE\",K2:K201,\">0\")","v":0},{"$f":"W19-X19","v":0},null,"CAMBIO BOLLA ",null,null,null,{"$f":"COUNTIF(N2:N201,\"CAMBIO BOLLA\")","v":0},null,null,null,"TELEFONA AL CLIENTE "]
[19,null,null,null,null,null,null,null,"",null,"",null,null,""]
[20,null,null,null,null,null,"C",null,"",null,"",null,null,"",null,null,null,null,null,"Totale Camion Barre",null,null,{"$f":"COUNTIF(H2:H201,\"BARRE\")","v":0},{"$f":"COUNTIFS(H2:H201,\"=BARRE\", K2:K201,\">0\")","v":0},{"$f":"W21-X21","v":0},null,"NON CARICATO",null,null,null,{"$f":"COUNTIF(N2:N201,\"NON CARICATO\")","v":0}]
[21,null,null,null,null,null,null,null,"",null,"",null,null,"",null,null,21]
[22,null,null,null,null,null,null,null,"",null,"",null,null,"",null,null,22,null,null,"Totale Camion Blumi",null,null,{"$f":"COUNTIF(H2:H201,\"BLUMI\")","v":0},{"$f":"COUNTIFS(H2:H201,\"=BLUMI\", K2:K201,\">0\")","v":0},{"$f":"W23-X23","v":0},null,"2 VIAGGI",null,null,null,{"$f":"COUNTIF(N2:N201,\"2 VIAGGI\")","v":0}]
[23,null,null,null,null,null,null,null,"",null,"",null,null,"",null,null,23]
[24,null,null,null,null,null,null,null,"",null,"",null,null,"",null,null,24,null,null,"Totale Camion Vergella",null,null,{"$f":"COUNTIF(H2:H201,\"VERGELLA\")","v":0},{"$f":"COUNTIFS(H2:H201,\"=VERGELLA\",K2:K201,\">0\")","v":0},{"$f":"W25-X25","v":0},null,"PRECEDENZA",null,null,null,{"$f":"COUNTIF(N2:N201,\"PRECEDENZA\")","v":0}]
[25,null,null,{"$f":"IFERROR(VLOOKUP(B26,TARE!C:E,3,0),\"\")","v":""},{"$f":"IFERROR(VLOOKUP(B26,TARE!C:E,2,0),\"\")","v":""},null,null,null,"",null,"",null,null,"",null,null,25]
[26,null,null,null,null,null,null,null,"",null,"",null,null,"",null,null,26,null,null,"Totale Camion Bulbi",null,null,{"$f":"COUNTIF(H2:H201,\"BULBI\")","v":0},{"$f":"COUNTIFS(H2:H201,\"=BULBI\", K2:K201,\">0\")","v":0},{"$f":"W27-X27","v":0},null,"MANCA TARGA ",null,null,null,{"$f":"COUNTIF(N2:N201,\"MANCA TARGA\")","v":0}]
[27,null,null,{"$f":"IFERROR(VLOOKUP(B28,TARE!C:E,3,0),\"\")","v":""},{"$f":"IFERROR(VLOOKUP(B28,TARE!C:E,2,0),\"\")","v":""},null,null,null,"",null,"",null,null,"",null,null,27]
[28,null,null,{"$f":"IFERROR(VLOOKUP(B29,TARE!C:E,3,0),\"\")","v":""},{"$f":"IFERROR(VLOOKUP(B29,TARE!C:E,2,0),\"\")","v":""},null,null,null,"",null,"",null,null,"",null,null,28,null,null,"Totale Camion Tubi",null,null,{"$f":"COUNTIF(H2:H201,\"TUBI\")","v":0},{"$f":"COUNTIFS(H2:H201,\"=TUBI\",K2:K201,\">0\")","v":0},{"$f":"W29-X29","v":0},null,"NON IDONEO",null,null,null,{"$f":"COUNTIF(N2:N201,\"NON IDONEO\")","v":0}]
[29,null,null,{"$f":"IFERROR(VLOOKUP(B30,TARE!C:E,3,0),\"\")","v":""},{"$f":"IFERROR(VLOOKUP(B30,TARE!C:E,2,0),\"\")","v":""},null,null,null,"",null,"",null,null,"",null,null,29]
[30,null,null,{"$f":"IFERROR(VLOOKUP(B31,TARE!C:E,3,0),\"\")","v":""},{"$f":"IFERROR(VLOOKUP(B31,TARE!C:E,2,0),\"\")","v":""},null,null,null,"",null,"",null,null,"",null,null,30,null,null,"Totale Camion Palancole",null,null,{"$f":"COUNTIF(H2:H201,\"PALANCOLE\")","v":0},{"$f":"COUNTIFS(H2:H201,\"=PALANCOLE\", K2:K201,\">0\")","v":0},{"$f":"W31-X31","v":0},null,"SCARICA",null,null,null,{"$f":"COUNTIF(N2:N201,\"SCARICA\")","v":0}]
[31,null,null,{"$f":"IFERROR(VLOOKUP(B32,TARE!C:E,3,0),\"\")","v":""},{"$f":"IFERROR(VLOOKUP(B32,TARE!C:E,2,0),\"\")","v":""},null,null,null,"",null,"",null,null,"",null,null,31]
[32,null,null,{"$f":"IFERROR(VLOOKUP(B33,TARE!C:E,3,0),\"\")","v":""},{"$f":"IFERROR(VLOOKUP(B33,TARE!C:E,2,0),\"\")","v":""},null,null,null,"",null,"",null,null,"",null,null,32,null,null,"Totale Camion Tronchi",null,null,{"$f":"COUNTIF(H4:H201,\"TRONCHI\")","v":0},{"$f":"COUNTIFS(H2:H201,\"=TRONCHI\", K2:K201,\">0\")","v":0},{"$f":"W33-X33","v":0},null,"CAMBIO TARGA AL CARICO",null,null,null,{"$f":"COUNTIF(N2:N201,\"CAMBIO TARGA AL CARICO\")","v":0}]
[33,null,null,null,null,null,null,null,"",null,"",null,null,"",null,null,33]
[34,null,null,{"$f":"IFERROR(VLOOKUP(B35,TARE!C:E,3,0),\"\")","v":""},{"$f":"IFERROR(VLOOKUP(B35,TARE!C:E,2,0),\"\")","v":""},null,null,null,"",null,"",null,null,"",null,null,34,null,null,"Totale Camion Eccezionali",null,null,{"$f":"COUNTIF(D4:D201,\"E\")","v":0},null,null,null,"USCITO SENZA BOLLA",null,null,null,{"$f":"COUNTIF(N2:N201,\"USCITO SENZA BOLLA\")","v":0}]
[35,null,null,{"$f":"IFERROR(VLOOKUP(B36,TARE!C:E,3,0),\"\")","v":""},{"$f":"IFERROR(VLOOKUP(B36,TARE!C:E,2,0),\"\")","v":""},null,null,null,"",null,"",null,null,"",null,null,35]
[36,null,null,{"$f":"IFERROR(VLOOKUP(B37,TARE!C:E,3,0),\"\")","v":""},{"$f":"IFERROR(VLOOKUP(B37,TARE!C:E,2,0),\"\")","v":""},null,null,null,"",null,"",null,null,"",null,null,36,null,"TRASFERIMENTO",null,null,null,{"$f":"COUNTIF(N2:N201,\"TRASFERIMENTO\")","v":0},null,null,null,"Ricerca a 3 fattori variabili"]
[37,null,null,{"$f":"IFERROR(VLOOKUP(B38,TARE!C:E,3,0),\"\")","v":""},{"$f":"IFERROR(VLOOKUP(B38,TARE!C:E,2,0),\"\")","v":""},null,null,null,"",null,"",null,null,"",null,null,37,null,"CONTEGGIO VIAGGI PER MEZZO"]
[38,null,null,{"$f":"IFERROR(VLOOKUP(B39,TARE!C:E,3,0),\"\")","v":""},{"$f":"IFERROR(VLOOKUP(B39,TARE!C:E,2,0),\"\")","v":""},null,null,null,"",null,"",null,null,"",null,null,38,null,"1° MEZZO",null,null,null,{"$f":"COUNTIFS($B$2:$B$201,T39, $N$2:$N$201,$S$37,$F$2:$F$201,S40)","v":0},null,null,null,"Inserisci nome CLIENTE",null,null,null,null,null,null,"Nr di Camion entrati",null,null,null,{"$f":"COUNTIFS(F2:F201,AC39, C2:C201,AC41, H2:H201,AC43)","v":0}]
[39,null,null,{"$f":"IFERROR(VLOOKUP(B40,TARE!C:E,3,0),\"\")","v":""},{"$f":"IFERROR(VLOOKUP(B40,TARE!C:E,2,0),\"\")","v":""},null,null,null,"",null,"",null,null,"",null,null,39]
{"$rows_left_out":162}
{"sheet":"Zona di Carico","index":1,"n_rows":25,"n_cols":7,"rows_kept":25,"cut":false,"hidden":false,"merged":[[1,1,1,6],[2,5,2,7]]}
[]
[null,"ELENCO ZONE DI CARICO"]
[null,null,null,null,null,"CAMION PER ZONA"]
[null,1,null,2,null,null,{"$f":"COUNTIFS(ENTRATE!P2:'ENTRATE'!P161,\"2\", ENTRATE!I2:'ENTRATE'!I161,\">0\", ENTRATE!K2:'ENTRATE'!K161,\"\")","v":0}]
[null,2,null,"STR.3",null,null,{"$f":"COUNTIFS(ENTRATE!P2:'ENTRATE'!P161,\"STR.3\", ENTRATE!I2:'ENTRATE'!I161,\">0\", ENTRATE!K2:'ENTRATE'!K161,\"\")","v":0}]
[null,3,null,"3/PICKING",null,null,{"$f":"COUNTIFS(ENTRATE!P2:'ENTRATE'!P161,\"3/PICKING\", ENTRATE!I2:'ENTRATE'!I161,\">0\", ENTRATE!K2:'ENTRATE'!K161,\"\")","v":0}]
[null,4,null,4,null,null,{"$f":"COUNTIFS(ENTRATE!P2:'ENTRATE'!P161,\"4\", ENTRATE!I2:'ENTRATE'!I161,\">0\", ENTRATE!K2:'ENTRATE'!K161,\"\")","v":0}]
[null,5,null,5,null,null,{"$f":"COUNTIF(ENTRATE!P2:'ENTRATE'!P161,\"5\")","v":0}]
[null,6,null,6,null,null,{"$f":"COUNTIFS(ENTRATE!P2:'ENTRATE'!P161,\"6\", ENTRATE!I2:'ENTRATE'!I161,\">0\", ENTRATE!K2:'ENTRATE'!K161,\"\")","v":0}]
[null,7,null,8,null,null,{"$f":"COUNTIFS(ENTRATE!P2:'ENTRATE'!P161,\"8\", ENTRATE!I2:'ENTRATE'!I161,\">0\", ENTRATE!K2:'ENTRATE'!K161,\"\")","v":0}]
[null,8,null,"8/CAP1",null,null,{"$f":"COUNTIFS(ENTRATE!P2:'ENTRATE'!P161,\"8/CAP1\", ENTRATE!I2:'ENTRATE'!I161,\">0\", ENTRATE!K2:'ENTRATE'!K161,\"\")","v":0}]
[null,9,null,18,null,null,{"$f":"COUNTIFS(ENTRATE!P2:'ENTRATE'!P161,\"18\", ENTRATE!I2:'ENTRATE'!I161,\">0\", ENTRATE!K2:'ENTRATE'!K161,\"\")","v":0}]
[null,10,null,16,null,null,{"$f":"COUNTIFS(ENTRATE!P2:'ENTRATE'!P161,\"16\", ENTRATE!I2:'ENTRATE'!I161,\">0\", ENTRATE!K2:'ENTRATE'!K161,\"\")","v":0}]
[null,11,null,"16/SILOS",null,null,{"$f":"COUNTIFS(ENTRATE!P2:'ENTRATE'!P161,\"16/SILOS\", ENTRATE!I2:'ENTRATE'!I161,\">0\", ENTRATE!K2:'ENTRATE'!K161,\"\")","v":0}]
[null,12,null,10,null,null,{"$f":"COUNTIFS(ENTRATE!P2:'ENTRATE'!P161,\"10\", ENTRATE!I2:'ENTRATE'!I161,\">0\", ENTRATE!K2:'ENTRATE'!K161,\"\")","v":0}]
[null,13,null,12,null,null,{"$f":"COUNTIFS(ENTRATE!P2:'ENTRATE'!P161,\"12\", ENTRATE!I2:'ENTRATE'!I161,\">0\", ENTRATE!K2:'ENTRATE'!K161,\"\")","v":0}]
[null,14,null,"EX.MERZ.",null,null,{"$f":"COUNTIFS(ENTRATE!P2:'ENTRATE'!P161,\"EX.MERZ.\", ENTRATE!I2:'ENTRATE'!I161,\">0\", ENTRATE!K2:'ENTRATE'!K161,\"\")","v":0}]
[null,15,null,"S.MARCO",null,null,{"$f":"COUNTIFS(ENTRATE!P2:'ENTRATE'!P161,\"S.MARCO\", ENTRATE!I2:'ENTRATE'!I161,\">0\", ENTRATE!K2:'ENTRATE'!K161,\"\")","v":0}]
[null,16,null,"3B",null,null,{"$f":"COUNTIFS(ENTRATE!P2:'ENTRATE'!P161,\"3B\", ENTRATE!I2:'ENTRATE'!I161,\">0\", ENTRATE!K2:'ENTRATE'!K161,\"\")","v":0}]
[null,17,null,"RA MILL",null,null,{"$f":"COUNTIFS(ENTRATE!P2:'ENTRATE'!P161,\"RA MILL\", ENTRATE!I2:'ENTRATE'!I161,\">0\", ENTRATE!K2:'ENTRATE'!K161,\"\")","v":0}]
[null,18,null,"MICRON MIN",null,null,{"$f":"COUNTIFS(ENTRATE!P2:'ENTRATE'!P161,\"MICRON MIN\", ENTRATE!I2:'ENTRATE'!I161,\">0\", ENTRATE!K2:'ENTRATE'!K161,\"\")","v":0}]
[null,19,null,"COLACEM",null,null,{"$f":"COUNTIFS(ENTRATE!P3:'ENTRATE'!P162,\"COLACEM\", ENTRATE!I3:'ENTRATE'!I162,\">0\", ENTRATE!K3:'ENTRATE'!K162,\"\")","v":0}]
[null,20,null,"SOCO VECCHIA",null,null,{"$f":"COUNTIFS(ENTRATE!P3:'ENTRATE'!P201,\"SOCO VECCHIA\", ENTRATE!I3:'ENTRATE'!I201,\">0\", ENTRATE!K3:'ENTRATE'!K201,\"\")","v":0}]
[null,21,null,"CONSORZIO",null,null,{"$f":"COUNTIFS(ENTRATE!P4:'ENTRATE'!P202,\"CONSORZIO\", ENTRATE!I4:'ENTRATE'!I202,\">0\", ENTRATE!K4:'ENTRATE'!K202,\"\")","v":0}]
[null,22,null,null,null,null,{"$f":"COUNTIFS(ENTRATE!P5:'ENTRATE'!P203,\"SOCO VECCHIA\", ENTRATE!I5:'ENTRATE'!I203,\">0\", ENTRATE!K5:'ENTRATE'!K203,\"\")","v":0}]

{"sheet":"STATS S.","index":2,"n_rows":45,"n_cols":8,"rows_kept":45,"cut":false,"hidden":false,"merged":[[0,0,1,18],[4,0,4,2],[6,0,6,2],[8,0,8,2],[10,0,10,2],[4,4,4,5],[4,7,4,9],[5,0,5,2],[7,0,7,2],[9,0,9,2],[15,0,15,2],[17,0,17,2],[19,0,19,2],[12,0,12,2],[35,0,35,2],[21,0,21,2],[14,0,14,2],[16,0,16,2],[18,0,18,2],[20,0,20,2],[29,0,29,18],[48,0,48,2],[11,0,11,2],[13,0,13,2],[42,0,42,2],[43,0,43,2],[44,0,44,2],[22,0,22,2],[24,0,24,2],[26,0,26,2],[41,0,41,2],[36,0,36,2],[37,0,37,2],[38,0,38,2],[39,0,39,2],[40,0,40,2],[34,0,34,2]]}
["STATISTICHE GIORNALIERE SPUNATATORI"]
[]
[]
[]
["NOMI SPUNTATORI PRESENTI",null,null,null,"ABBREVIAZIONE",null,null,"NR CARICHI EFFETTUATI"]
[]
[{"$f":"A35","v":"CLAUDIO"},null,null,null,{"$f":"E35","v":"CLA"},null,null,{"$f":"COUNTIFS(ENTRATE!L2:M201,'STATS S.'!E35)","v":0}]
[]
[{"$f":"A36","v":"GIUSEPPE Q"},null,null,null,{"$f":"E36","v":"GQ"},null,null,{"$f":"COUNTIFS(ENTRATE!L2:M201,'STATS S.'!E36)","v":0}]
[]
[{"$f":"A37","v":"LELLO"},null,null,null,{"$f":"E37","v":"LEL"},null,null,{"$f":"COUNTIFS(ENTRATE!L2:M201,'STATS S.'!E37)","v":0}]
[]
[{"$f":"A38","v":"NIKODEM"},null,null,null,{"$f":"E38","v":"NIKO"},null,null,{"$f":"COUNTIFS(ENTRATE!L2:M201,'STATS S.'!E38)","v":0}]
[]
["GIUSEPPE",null,null,null,"GM",null,null,{"$f":"COUNTIFS(ENTRATE!L2:M201,'STATS S.'!E39)","v":0}]
[]
[{"$f":"A40","v":"BELLINI"},null,null,null,{"$f":"E40","v":"BEL"},null,null,{"$f":"COUNTIFS(ENTRATE!L2:M201,'STATS S.'!E40)","v":0}]
[]
[{"$f":"A41","v":"MARCO L"},null,null,null,{"$f":"E41","v":"ML"},null,null,{"$f":"COUNTIFS(ENTRATE!L2:M201,'STATS S.'!E41)","v":0}]
[]
[{"$f":"A42","v":"ALESSANDRO"},null,null,null,{"$f":"E42","v":"AM"},null,null,{"$f":"COUNTIFS(ENTRATE!L2:M201,'STATS S.'!E42)","v":0}]
[]
[{"$f":"A43","v":"CIRILLO"},null,null,null,{"$f":"E43","v":"CIR"},null,null,{"$f":"COUNTIFS(ENTRATE!L2:M201,'STATS S.'!E43)","v":0}]
[]
[{"$f":"A44","v":"NON ASS"},null,null,null,{"$f":"E44","v":"NO"},null,null,{"$f":"COUNTIFS(ENTRATE!L2:M201,'STATS S.'!E44)","v":0}]
[]
[{"$f":"A45","v":"NON ASS"},null,null,null,{"$f":"E45","v":"NO"},null,null,{"$f":"COUNTIFS(ENTRATE!L2:M201,'STATS S.'!E45)","v":0}]
[]
[]
["Ideato e Creato da Marco Rosini"]
[]
[]
[]
[]
["CLAUDIO",null,null,null,"CLA"]
["GIUSEPPE Q",null,null,null,"GQ"]
["LELLO",null,null,null,"LEL"]
["NIKODEM",null,null,null,"NIKO"]
["GIUSEPPE",null,null,null,"GM"]
["BELLINI",null,null,null,"BEL"]
{"$rows_left_out":6}
{"sheet":"TARE","index":3,"n_rows":504,"n_cols":6,"rows_kept":504,"cut":false,"hidden":false,"merged":[[1,1,1,5]]}
[]
[null,"ELENCO TARGHE E TARE MEZZI ECCEZIONALI"]
[]
[]
[null,null,"TARGA","TARA"]
[]
[null,1,"CE579WV",22900,"E","PIGOZZI"]
[null,2,"EY507LD",22025,"E","PIGOZZI"]
[null,3,"FD915KB",22325,"E","PIGOZZI"]
[null,4,"DW320AJ",21950,"E","PIGOZZI"]
[null,5,"DR441EL",23625,"E","PIGOZZI"]
[null,6,"BR109HE",24000,"E","TCF"]
[null,7,"BR110HE",24000,"E","TCF"]
[null,8,"BT579MK",24000,"E","TCF"]
[null,9,"EP105JJ",24000,"E","TCF"]
[null,10,"BW807KG",24000,"E","TCF"]
[null,11,"CA685SY",31000,"E","TCF"]
[null,12,"CA686SY",31000,"E","TCF"]
[null,13,"CH596EZ",31000,"E","TCF"]
[null,14,"CK619KR",31000,"E","TCF"]
[null,15,"CK947KR",31000,"E","TCF"]
[null,16,"CN265WS",31000,"E","TCF"]
[null,17,"CN283XD",31000,"E","TCF"]
[null,18,"CR365DC",31000,"E","TCF"]
[null,19,"CR366DC",31000,"E","TCF"]
[null,20,"DE146CP",29500,"E","TCF"]
[null,21,"DE147CP",30000,"E","TCF"]
[null,22,"DE539CP",30000,"E","TCF"]
[null,23,"DE540CP",30000,"E","TCF"]
[null,24,"DH220KC",30000,"E","TCF"]
[null,25,"DL558CH",30800,"E","TCF"]
[null,26,"DM320MJ",30000,"E","TCF"]
[null,27,"DN052YV",30000,"E","TCF"]
[null,28,"DN 155YV",30800,"E","TCF"]
[null,29,"DP203YD",30800,"E","TCF"]
[null,30,"DV133HT",30800,"E","TCF"]
[null,31,"EC584AR",30000,"E","TCF"]
[null,32,"EC585AR",30000,"E","TCF"]
[null,33,"CX266FL",29000,"E","TCF"]
[null,34,"DA433NC",29500,"E","TCF"]
{"$rows_left_out":465}
{"sheet":"MERCI","index":4,"n_rows":30,"n_cols":5,"rows_kept":30,"cut":false,"hidden":false,"merged":[[0,3,0,4]]}
[null,null,null,"DIZIONARIO"]
[null,null,null,"COILS ACCIAIO ","COILS"]
[null,null,null,"COILS ACCIAIO INOX","COILS"]
[null,null,null,"COILS A CALDO","COILS"]
[null,null,null,"COILS A FREDDO","COILS"]
[null,null,null,"COILS DECAPATI A ","COILS"]
[null,null,null,"COILS ZINCATI ","COILS"]
[null,null,null,"COILS PREVERNICIATI","COILS"]
[null,null,null,"COILS ELETTROGALVANIZZATI","COILS"]
[null,null,null,"NASTRI A FREDDO","COILS"]
[null,null,null,"COILS MAGNETICI","COILS"]
[null,null,null,"COILS ALUZINCATI","COILS"]
[null,null,null,"COILS A CALDO BUGNATI","COILS"]
[null,null,null,"COILS STRIATI","COILS"]
[null,null,null,"COILS FREDDO INOX","COILS"]
[null,"COILS",null,"COILS ALLUMINATI","COILS"]
[null,"BARRE",null,"COILS ZINCATI PREVERNICIATI","COILS"]
[null,"LAMIERE",null,"BARRE","BARRE"]
[null,"BLUMI",null,"LAMIERE","LAMIERE"]
[null,"TUBI",null,"BLUMI","BLUMI"]
[null,"PALANCOLE",null,"TUBI","TUBI"]
[null,"TRONCHI",null,"PALANCOLE","PALANCOLE"]
[null,"SEGATI",null,"TRONCHI","TRONCHI"]
[null,"BRAMME",null,"SEGATI","SEGATI"]
[null,"BILLETTE",null,"BRAMME","BRAMME"]
[null,"GHISA",null,"BILLETTE","BILLETTE"]
[null,"PROFILI ACC",null,"GHISA","GHISA"]
[null,"BANDA STA",null,"PROFILI ACCIAIO","PROFILI ACC"]
[null,"BANDA STA",null,"BANDA STAGNA","BANDA STA"]
[null,"COILS",null,"COILS SU BANDA STAGNA","BANDA STA"]